matériau sulfidique
type: Concept
subject: Pedology @en
subject: Agronomie
subject: Pédologie
subject: Agronomy @en
alternative label: matériau thionique
definition: Matériau minéral ou organominéral, gorgé d'eau, qui contient au moins 0,75 % de soufre, surtout sous forme de sulfures (Référentiel Pédologique). (Source : INRA)
in scheme: PLP
note: Ce matériau s'accumule dans des zones continuellement saturées en eau généralement salée ou saumâtre (mangroves, marais maritimes). Les sulfates présents dans l'eau sont réduits par voie biologique en sulfures. Par assèchement naturel ou par drainage artificiel, les sulfures s'oxydent et produisent de l'acide sulfurique. Le pH normalement voisin de la neutralité peut s'abaisser en dessous de 2. L'acide réagit avec le sol pour former des sulfates de fer et d'aluminium, dont la jarosite. (Source : INRA)
preferred label: sulfidic material @en
related: http://opendata.inrae.fr/PLP/969
related: http://opendata.inrae.fr/PLP/929
related: http://opendata.inrae.fr/PLP/534
related: http://opendata.inrae.fr/PLP/889
top concept of: PLP

RDF description of
primary topic: matériau sulfidique