mélanisation
type: Concept
subject: Pedology @en
subject: Pédologie
definition: Processus d'acquisition d'une couleur noire ou très foncée par un horizon de sol argileux suite à la pénétration de petites quantité de matière organique dans les feuillets d'argile en position interfoliaire. (Source : INRA)
in scheme: PLP
note: C'est le cas de certains vertisols ou Leptismectisols (dits " mélanisés ") et de certains horizons supérieurs de sols rouges en position de bas de versants à mauvais drainage interne. (Source : INRA)
note: Sens ancien : formation de l'humus et son incorporation progressive au sol. (Source : INRA)
preferred label: melanization @en
top concept of: PLP

RDF description of
primary topic: mélanisation