RDF description of
primary topic: mésotrophe

mésotrophe
type: Concept
subject: Pedology @en
subject: Pédologie
definition: Qualifie un sol, autre qu'un histosol, ou un horizon dans lequel les conditions de nutrition des plantes, telles que abondance de nutriments et de calcium et aération, ne sont pas très favorables. (Source : INRA)
in scheme: PLP
note: Dans le Référentiel pédologique, on qualifie de mésotrophe un histosol dont la production primaire de biomasse est moyenne. Un tel milieu est imparfaitement révélé par un pH compris entre 4,5 et 6. (Source : INRA)
preferred label: mesotrophic @en
related: http://opendata.inrae.fr/PLP/291
related: http://opendata.inrae.fr/PLP/658
related: http://opendata.inrae.fr/PLP/347
top concept of: PLP