acid
type: Concept
subject: Pedology
subject: Pédologie @fr
alternative label: acidic
definition: Qualifie un horizon ou un solum dont le pH eau est inférieur ou égal à 6,5 (Référentiel Pédologique). (Source : INRA) @fr
in scheme: PLP
preferred label: acide @fr
related: http://opendata.inrae.fr/PLP/702
top concept of: PLP

RDF description of
primary topic: acid