micas
type: Concept
subject: Mineralogy @en
subject: Geology @en
subject: Géologie
subject: Minéralogie
definition: Minéraux appartenant aux phyllosilicates dont les feuillets élémentaires font 0,1 nanomètre d'épaisseur. (Source : INRA)
in scheme: PLP
note: Ce sont des minéraux primaires de la plupart des roches ignées et métamorphiques et de quelques roches sédimentaires. (Source : INRA)
related: http://opendata.inrae.fr/PLP/115
related: http://opendata.inrae.fr/PLP/79
related: http://opendata.inrae.fr/PLP/636
top concept of: PLP

RDF description of
primary topic: micas