anthropogène
type: Concept
subject: Pedology @en
subject: Pédologie
definition: Qualifie une modification, une contamination ou une pollution liée à une ou plusieurs activités humaines. (Source : INRA)
in scheme: PLP
note: S'oppose à " géogène ", à " pédogène " et à "biogène". (Source : INRA)
preferred label: anthropogenic @en
top concept of: PLP

RDF description of
primary topic: anthropogène