RDF description of
primary topic: microrelief gilgaï

microrelief gilgaï
type: Concept
subject: Pedology @en
subject: Pédologie
definition: Forme de terrain caractérisée soit par une succession de microdépressions fermées et de micromonticules sur des surfaces presque planes, soit de microvallées et de microcrêtes parallèles suivant le sens de la pente. (Source : INRA)
in scheme: PLP
note: La hauteur des micro-crêtes est de l'ordre de quelques centimètres jusqu'à un maximum de 1 m. Ce micro-relief est la conséquence du gonflement différentiel de masses de sols à argiles gonflantes au moment de la réhumectation et de fermeture des macro-fentes. Il est typiquement associé aux vertisols, mais des terrains constitués de vertisols peuvent en être dépourvus. (Source : INRA)
preferred label: gilgai microrelief @en
related: http://opendata.inrae.fr/PLP/1001
top concept of: PLP