RDF description of
primary topic: milliéquivalent

milliéquivalent
type: Concept
subject: Pedology @en
subject: Pédologie
alternative label: mé
alternative label: me @en
definition: Unité spécialement utilisée pour exprimer la capacité d'échange cationique et des ions échangeables et correspondant à un millième d'équivalent-gramme. (Source : INRA)
in scheme: PLP
note: Un équivalent-gramme est égal à un atome-gramme ou une molécule-gramme ou un ion-gramme divisé par la valence. Selon les normes officielles, il vaut mieux employer désormais la mole qui définit la même grandeur que l'équivalent. En conséquence : 1 mé/ 100 g est exactement égal à 1 cmol+/kg. (Source : INRA)
preferred label: milliequivalent @en
top concept of: PLP