RDF description of
primary topic: minéraux amorphes

minéraux amorphes
type: Concept
subject: Mineralogy @en
subject: Pedology @en
subject: Minéralogie
subject: Pédologie
definition: Minéraux pour lesquels l'absence de régularité dans l'arrangement des atomes ne donne pas de biréfringence à l'examen de lames minces au microscope polarisant, ni de spectre reconnaissable en diffraction de rayons X. (Source : INRA)
in scheme: PLP
preferred label: amorphous minerals @en
related: http://opendata.inrae.fr/PLP/618
top concept of: PLP