minéraux argileux
type: Concept
subject: Mineralogy @en
subject: Pedology @en
subject: Minéralogie
subject: Pédologie
modified: 2020-08-27T15:00:46.068+02:00
alternative label: argiles
definition: Phyllosilicates de petites dimensions, presque toujours inférieures à 5 µm, abondants ou très abondants dans les sols, et résultant de l'altération de minéraux primaires ou directement hérités, comme dans le cas des roches sédimentaires. (Source : INRA)
in scheme: PLP
note: Les minéraux argileux 1/1 sont caractérisés par un feuillet à une couche de tétraèdres de SiO2 pour une couche octaédrique de Al2O3 et dont la charge électrique est nulle. Ce feuillet a une épaisseur de 7 angströms. (Source : INRA)
note: Les minéraux argileux 2/1 sont des minéraux dont le feuillet constitué de la superposition de deux couches de tétraèdres de SiO2 pour une couche octaédrique gibbsitique. Ce feuillet, d'une épaisseur supérieure ou égale à 10 angströms, présente une certaine charge électrique qui doit être compensée par la rétention d'un certain nombre de cations en positions interfoliaires. (Source : INRA)
preferred label: clay minerals @en
related: http://opendata.inrae.fr/PLP/626
related: http://opendata.inrae.fr/PLP/82
related: http://opendata.inrae.fr/PLP/505
related: http://opendata.inrae.fr/PLP/276
related: http://opendata.inrae.fr/PLP/707
related: http://opendata.inrae.fr/PLP/79
related: http://opendata.inrae.fr/PLP/653
related: http://opendata.inrae.fr/PLP/863
related: http://opendata.inrae.fr/PLP/180
related: http://opendata.inrae.fr/PLP/536
related: http://opendata.inrae.fr/PLP/998
related: http://opendata.inrae.fr/PLP/105
top concept of: PLP

RDF description of
primary topic: minéraux argileux