minéraux argileux interstratifiés
type: Concept
subject: Mineralogy @en
subject: Pedology @en
subject: Minéralogie
subject: Pédologie
definition: Minéraux argileux formés par l'alternance plus ou moins régulière de feuillets de natures différentes (exemple : illite-smectite, illite-chlorite). (Source : INRA)
in scheme: PLP
preferred label: mixed-layer clay minerals @en
top concept of: PLP

RDF description of
primary topic: minéraux argileux interstratifiés