RDF description of
primary topic: minéraux lourds

minéraux lourds
type: Concept
subject: Geology @en
subject: Géologie
definition: Ensemble des minéraux de forte densité dont les grains coulent au fond dans un bain de bromoforme (densité 2,87) alors que les minéraux légers comme le quartz ou les feldspaths flottent. (Source : INRA)
in scheme: PLP
note: Le sphène, le zircon, le rutile, l'anatase, la tourmaline sont des exemples de minéraux lourds. Leur étude permet d'avoir une idée de l'origine des composants détritiques du sédiment auxquels ils appartiennent. Ne pas confondre minéraux lourds et métaux lourds. (Source : INRA)
preferred label: heavy minerals @en
related: http://opendata.inrae.fr/PLP/1010
top concept of: PLP