short-range-order minerals
type: Concept
subject: Mineralogy
subject: Pedology
subject: Minéralogie @fr
subject: Pédologie @fr
alternative label: paracrystalline minerals
alternative label: short-range-ordered minerals
definition: Minéraux constitués de très petits cristaux, appréhendables seulement avec certaines techniques. (Source : INRA) @fr
in scheme: PLP
note: Ces minéraux (allophanes, imogolite, etc.) semblent amorphes lorsqu'ils sont étudiés par exemple par diffraction des rayons X. (Source : INRA) @fr
preferred label: minéraux paracristallins @fr
related: http://opendata.inrae.fr/PLP/51
related: http://opendata.inrae.fr/PLP/614
related: http://opendata.inrae.fr/PLP/38
top concept of: PLP

RDF description of
primary topic: short-range-order minerals