minéraux primaires
type: Concept
subject: Pedology @en
subject: Pédologie
definition: Minéraux hérités directement des roches ou matériaux parentaux d'où proviennent les sols ou les altérites. (Source : INRA)
in scheme: PLP
note: Certains minéraux primaires sont plus ou moins aisément altérables, d'autres le sont peu ou pas du tout (mais cela dépend beaucoup des conditions pédoclimatiques et de la durée d'exposition aux agents de l'altération). Les produits d'altération des minéraux primaires non totalement évacués sont susceptibles de se recombiner et de former des minéraux nouveaux, absents des roches originelles, les minéraux secondaires. (Source : INRA)
preferred label: primary minerals @en
related: http://opendata.inrae.fr/PLP/858
related: http://opendata.inrae.fr/PLP/496
related: http://opendata.inrae.fr/PLP/40
related: http://opendata.inrae.fr/PLP/620
related: http://opendata.inrae.fr/PLP/613
top concept of: PLP

RDF description of
primary topic: minéraux primaires