anthrosols
type: Concept
subject: Pedology
subject: Pédologie @fr
definition: Groupe de sols de référence caractérisés par des transformations par des actions anthropiques tellement intenses que le sol originel n'est plus reconnaissable ou subsiste seulement comme un sol enterré (WRB). (Source : INRA) @fr
in scheme: PLP
related: http://opendata.inrae.fr/PLP/61
top concept of: PLP

RDF description of
primary topic: anthrosols