RDF description of
primary topic: minéraux secondaires

minéraux secondaires
type: Concept
subject: Pedology @en
subject: Pédologie
definition: Minéraux de néoformation présents dans les sols ou les altérites et qui n'existaient pas initialement dans les roches ou matériaux parentaux. (Source : INRA)
in scheme: PLP
note: Ces minéraux résultent de l'altération des minéraux primaires et de la recombinaison des éléments non totalement évacués. (Source : INRA)
preferred label: weathering minerals @en
related: http://opendata.inrae.fr/PLP/619
related: http://opendata.inrae.fr/PLP/40
related: http://opendata.inrae.fr/PLP/641
related: http://opendata.inrae.fr/PLP/851
related: http://opendata.inrae.fr/PLP/667
related: http://opendata.inrae.fr/PLP/625
related: http://opendata.inrae.fr/PLP/116
top concept of: PLP