RDF description of
primary topic: moders

moders
type: Concept
subject: Pedology @en
subject: Pédologie
definition: Formes d'humus forestières caractérisées par la destruction des litières due à l'activité de la méso- et macrofaune de surface, en l'absence d'activité notable des vers anéciques. (Source : INRA)
in scheme: PLP
note: Les moders sont donc observés dans des conditions écologiques défavorables aux vers anéciques et endogés : acidité du sol et pauvreté en calcium, températures basses, parfois asphyxie. Ils sont caractérisés par la présence d'un horizon A de juxtaposition, la séquence d'horizons OL, OF, OH, A ou OL, OF, A et un passage très progressif entre les horizons O et A. Outre les eumoders, on distingue des dysmoders, des hydromoders, des lithomoders et des peyromoders (Référentiel Pédologique 2007). (Source : INRA)
related: http://opendata.inrae.fr/PLP/495
related: http://opendata.inrae.fr/PLP/120
related: http://opendata.inrae.fr/PLP/918
related: http://opendata.inrae.fr/PLP/497
related: http://opendata.inrae.fr/PLP/775
related: http://opendata.inrae.fr/PLP/388
related: http://opendata.inrae.fr/PLP/446
related: http://opendata.inrae.fr/PLP/999
top concept of: PLP