RDF description of
primary topic: monolithe

monolithe
type: Concept
subject: Pedology @en
subject: Pédologie
definition: Gros échantillon de sol non remanié, découpé sur toute l'épaisseur du solum et ramené au laboratoire pour exposition. (Source : INRA)
in scheme: PLP
note: Le prélèvement sur le terrain nécessite un long travail de dégagement et un transport délicat. Au laboratoire, un minutieux travail de dégrossissage et de retouche est encore nécessaire, accompagné parfois d'une consolidation par des résines. (Source : INRA)
preferred label: monolith @en
related: http://opendata.inrae.fr/PLP/541
top concept of: PLP