RDF description of
primary topic: monosiallitisation

monosiallitisation
type: Concept
subject: Pedology @en
subject: Pédologie
definition: Type d'altération par hydrolyse intense, désalcalinisation totale des minéraux primaires et édification de minéraux argileux 1/1 de néogenèse (kaolinite ou halloysite). (Source : INRA)
in scheme: PLP
preferred label: monosiallitization @en
related: http://opendata.inrae.fr/PLP/851
related: http://opendata.inrae.fr/PLP/620
related: http://opendata.inrae.fr/PLP/536
related: http://opendata.inrae.fr/PLP/436
top concept of: PLP