RDF description of
primary topic: montmorillonites

montmorillonites
type: Concept
subject: Pedology @en
subject: Agronomie
subject: Pédologie
subject: Agronomy @en
definition: Famille de minéraux phylliteux 2/1 dioctaédriques avec substitutions en couches octaédriques et équidistance des feuillets variables. (Source : INRA)
in scheme: PLP
note: Le cation de substitution est généralement Mg2+ (dans les montmorillonites typiques) ou bien Fe2+, Mn2+ ou Cr2+. La charge globale est inférieure à 0,6. La caractéristique essentielle de ces minéraux est de posséder entre les feuillets un certain nombre de couches d'eau, d'où une équidistance variable. La capacité d'échange, très élevée, est comprise entre 100 et 130 cmol+/kg. Sont appelés montmorillonites de dégradation ou smectites de transformation des minéraux argileux issus de l'altération d'argiles micacées ayant acquis des propriétés de gonflement mais ne montrant pas les propriétés physiques et chimiques caractéristiques des véritables smectites. (Source : INRA)
related: http://opendata.inrae.fr/PLP/615
related: http://opendata.inrae.fr/PLP/863
related: http://opendata.inrae.fr/PLP/180
related: http://opendata.inrae.fr/PLP/105
top concept of: PLP