mors
type: Concept
subject: Pedology @en
subject: Pédologie
definition: Formes d'humus forestières qui résultent de la transformartion des matières organiques en quasi-absence d'activité animale. (Source : INRA)
in scheme: PLP
note: Sous nos climats de plaine ils sont peu fréquents, leur formation étant liée à des conditions d'extrême acidité aggravée par la présence de résineux ou d'Ericacées à résidus difficilement dégradables et toxiques pour la faune du sol ou par des engorgements. Ils sont caractérisés par la séquence d'horizons OL/OF/OH/horizon peu humifère ou OL/OF/OH/horizon humifère. La transition très rapide entre l'horizon OH et l'horizon sous-jacent est un caractère diagnostique. Outre des mors typiques, on distingue des hémimors, des lithomors et des hydromors (Référentiel Pédologique 2007). (Source : INRA)
related: http://opendata.inrae.fr/PLP/959
related: http://opendata.inrae.fr/PLP/495
related: http://opendata.inrae.fr/PLP/472
related: http://opendata.inrae.fr/PLP/500
related: http://opendata.inrae.fr/PLP/775
related: http://opendata.inrae.fr/PLP/388
top concept of: PLP

RDF description of
primary topic: mors