morille
type: Concept
subject: Pedology @en
subject: Pédologie
definition: Concrétion siliceuse sub-sphérique de 2 à 5 cm, ressemblant un peu à une morille, que l'on trouve dans certains calcaires des Charentes ou conservée dans les sols. (Source : INRA)
in scheme: PLP
preferred label: silica nodule @en
related: http://opendata.inrae.fr/PLP/859
related: http://opendata.inrae.fr/PLP/652
top concept of: PLP

RDF description of
primary topic: morille