morphogénétique
type: Concept
subject: Pedology @en
subject: Pédologie
definition: Qualifie une classification ou une typologie fondée principalement sur la morphologie des solums et l'interprétation pédogénétique qui en est donnée. (Source : INRA)
in scheme: PLP
note: C'était le cas de la Classification française des sols de 1967 élaborée par la Commission de Pédologie et de Cartographie des sols. (Source : INRA)
preferred label: morphogenetical @en
top concept of: PLP

RDF description of
primary topic: morphogénétique