morphologie des sols
type: Concept
subject: Pedology @en
subject: Agronomie
subject: Pédologie
subject: Agronomy @en
definition: Étude de l'aspect des solums observé à l'œil nu dans une fosse ou une tranchée. (Source : INRA)
in scheme: PLP
note: Tous les horizons qui se succèdent doivent être observés et décrits (couleur, structure, texture, éléments grossiers, etc.), ainsi que la forme et la netteté des transitions entre horizons. Ne pas confondre la morphologie des sols avec la géomorphologie. (Source : INRA)
preferred label: soil morphology @en
related: http://opendata.inrae.fr/PLP/607
related: http://opendata.inrae.fr/PLP/389
top concept of: PLP

RDF description of
primary topic: morphologie des sols