RDF description of
primary topic: motte

motte
type: Concept
subject: Pedology @en
subject: Agronomie
subject: Pédologie
subject: Agronomy @en
definition: Agrégat ou fragment artificiel des horizons de surface des sols cultivés, travaillés fréquemment par les outils agricoles, et dans lesquels la structuration naturelle est constamment modifiée par des actions qui cassent et émiettent et par d'autres qui compactent. (Source : INRA)
in scheme: PLP
preferred label: clod @en
related: http://opendata.inrae.fr/PLP/915
related: http://opendata.inrae.fr/PLP/23
top concept of: PLP