RDF description of
primary topic: Munsell soil color charts®

Munsell soil color charts®
type: Concept
subject: Pedology @en
subject: Pédologie
definition: Charte permettant la désignation objective et sous une forme codée des couleurs des matériaux pédologiques. (Source : INRA)
in scheme: PLP
note: Cette charte est organisée selon un espace à trois dimensions et coordonnées cylindriques : la teinte de base, la clarté et la pureté. (Source : INRA)
related: http://opendata.inrae.fr/PLP/945
related: http://opendata.inrae.fr/PLP/187
related: http://opendata.inrae.fr/PLP/225
related: http://opendata.inrae.fr/PLP/467
related: http://opendata.inrae.fr/PLP/764
top concept of: PLP