RDF description of
primary topic: mycélium

mycélium
type: Concept
subject: Pedology @en
subject: Pédologie
definition: Partie stérile des champignons, qui se développe dans les horizons O et A des sols sous forme de filaments, appelés hyphes. (Source : INRA)
in scheme: PLP
preferred label: mycelium @en
related: http://opendata.inrae.fr/PLP/762
top concept of: PLP