nappe libre
type: Concept
subject: Pedology @en
subject: Hydrogéologie
subject: Agronomie
subject: Pédologie
subject: Agronomy @en
subject: Hydrogeology @en
definition: Eau contenue dans un aquifère peu profond dont le trop plein peut donner naissance à une source et dont la partie supérieure peut générer un engorgement temporaire ou permanent dans des horizons de sols. (Source : INRA)
in scheme: PLP
preferred label: unconfined water table @en
related: http://opendata.inrae.fr/PLP/1012
related: http://opendata.inrae.fr/PLP/640
related: http://opendata.inrae.fr/PLP/67
top concept of: PLP

RDF description of
primary topic: nappe libre