apédique
type: Concept
subject: Pedology @en
subject: Pédologie
definition: Qualifie la structure d'un horizon qui, en conséquence de son évolution pédologique, ne présente plus d'agrégats, soit suite à des départs de matières (horizons E), soit à des accumulations sous formes indurées. (Source : INRA)
in scheme: PLP
preferred label: apedal @en
related: http://opendata.inrae.fr/PLP/907
top concept of: PLP

RDF description of
primary topic: apédique