RDF description of
primary topic: appauvrissement en argile

appauvrissement en argile
type: Concept
subject: Pedology @en
subject: Pédologie
alternative label: clay loss @en
definition: Diminution de la teneur en argile d'un horizon de sol pouvant résulter de divers processus pédogénétiques (illuviation verticale, lessivage latéral, départ des particules les plus fines suite au ruissellement superficiel). (Source : INRA)
in scheme: PLP
note: En général, les horizons appauvris en argile plus ou moins intensément sont les horizons supérieurs et notamment l'horizon de surface. (Source : INRA)
preferred label: clay impoverishment @en
related: http://opendata.inrae.fr/PLP/718
related: http://opendata.inrae.fr/PLP/521
related: http://opendata.inrae.fr/PLP/321
related: http://opendata.inrae.fr/PLP/328
top concept of: PLP