RDF description of
primary topic: néoformation

néoformation
type: Concept
subject: Pedology @en
subject: Pédologie
alternative label: neogenesis @en
alternative label: néogenése
definition: Processus de formation d'un minéral qui n'existait pas initialement dans le sol ou dans le matériau parental. (Source : INRA)
in scheme: PLP
note: Exemple : minéraux argileux de néoformation. (Source : INRA)
preferred label: neoformation @en
related: http://opendata.inrae.fr/PLP/81
related: http://opendata.inrae.fr/PLP/620
top concept of: PLP