RDF description of
primary topic: nitisols

nitisols
type: Concept
subject: Pedology @en
subject: Pédologie
definition: Groupes de sols de référence rassemblant des sols épais, bien drainés, de texture argileuse et de couleur brun rouge ou rouge sombre, montrant une structure polyédrique anguleuse et des faces d'agrégats luisantes (WRB). (Source : INRA)
in scheme: PLP
note: Les propriétés nitiques résultent de différents processus parmi lesquels le processus de ferrallitisation, mais encore à un stade précoce. (Source : INRA)
top concept of: PLP