netteté des limites d'horizons
type: Concept
subject: Pedology @en
subject: Pédologie
definition: Qualité dépendant à la fois du contraste et de la transition plus ou moins rapide entre deux horizons. (Source : INRA)
in scheme: PLP
note: La netteté de la limite entre deux horizons superposés est aussi importante à décrire que sa forme. Une transition graduelle peut accompagner un contraste fort et une limite nette séparer deux horizons peu contrastés. Une limite est donc d'autant plus difficile à localiser et à définir que la transition est graduelle. Le glossaire Informatique et Biosphère de 1969 propose les cinq modalités suivantes : - transition très nette = contact direct (i.e. pas de transition), - transition nette (ou abrupte) = transition se faisant sur moins de 2 cm, - transition distincte = transition se faisant sur 2 à 5 cm, - transition graduelle = transition se faisant sur 5 à 12 cm, - transition diffuse = transition se faisant sur plus de 12 cm. Si la transition se fait sur plus de 12 cm, il est préférable de distinguer un horizon indépendant que l'on peut décrire en tant que tel, ou bien que l'on peut nommer horizon de transition sans obligatoirement le décrire. (Source : INRA)
preferred label: distinctness @en
related: http://opendata.inrae.fr/PLP/551
related: http://opendata.inrae.fr/PLP/169
top concept of: PLP

RDF description of
primary topic: netteté des limites d'horizons