nitrification
type: Concept
subject: Pedology @en
subject: Agronomie
subject: Pédologie
subject: Agronomy @en
definition: Processus d'oxydation biologique de l'azote, réalisé par des micro-organismes, au cours duquel l'azote passe de la forme ammoniacale ( NH4+ ) à la forme nitreuse ( NO2 ), puis nitrique ( NO3 ). (Source : INRA)
in scheme: PLP
top concept of: PLP

RDF description of
primary topic: nitrification