RDF description of
primary topic: nitrophile

nitrophile
type: Concept
subject: Ecology @en
subject: Écologie
definition: Qualifie une espèce animale ou végétale qui vit préférentiellement dans des milieux riches en azote minéral. (Source : INRA)
in scheme: PLP
preferred label: nitrophilous @en
top concept of: PLP