niveaux d' organisation
type: Concept
subject: Pedology @en
subject: Pédologie
definition: Niveaux d'organisation des couvertures pédologiques tels que les particules, les assemblages élémentaires, les agrégats, les horizons, les systèmes pédologiques, etc. (Source : INRA)
in scheme: PLP
note: Il est souvent fait mention de ces volumes emboîtés que les pédologues étudient à différentes échelles spatiales et avec différents outils d'investigation adaptés. Sont-ils de véritables niveaux d'organisation naturels ou s'agit-il d'une façon pédagogique de présenter une réalité complexe en fonction des moyens d'investigation employés ? (Source : INRA)
preferred label: levels of organization @en
related: http://opendata.inrae.fr/PLP/915
related: http://opendata.inrae.fr/PLP/663
related: http://opendata.inrae.fr/PLP/996
related: http://opendata.inrae.fr/PLP/647
top concept of: PLP

RDF description of
primary topic: niveaux d' organisation