nodules
type: Concept
subject: Pedology @en
subject: Pédologie
definition: Petits volumes d'origine pédogénétique, indurés, présentant une cohésion très supérieure à celle de l'horizon qui les englobe (Source : INRA)
in scheme: PLP
note: Il existe des nodules calcaires et ferromanganiques. Ce terme est plus général que concrétions. Certains nodules, hérités des matériaux parentaux ou de paléosols disparus, se retrouvent inaltérés ou peu altérés dans les sols. (Source : INRA)
related: http://opendata.inrae.fr/PLP/979
related: http://opendata.inrae.fr/PLP/319
related: http://opendata.inrae.fr/PLP/209
related: http://opendata.inrae.fr/PLP/628
related: http://opendata.inrae.fr/PLP/587
related: http://opendata.inrae.fr/PLP/753
related: http://opendata.inrae.fr/PLP/316
top concept of: PLP

RDF description of
primary topic: nodules