RDF description of
primary topic: nontronites

nontronites
type: Concept
subject: Mineralogy @en
subject: Pedology @en
subject: Minéralogie
subject: Pédologie
alternative label: beidellites ferrifères
definition: Minéraux argileux du groupe des smectites dioctaédriques alumino-ferrifères dans lesquels le rapport Al/Fe est inférieur à 1. (Source : INRA)
in scheme: PLP
related: http://opendata.inrae.fr/PLP/615
related: http://opendata.inrae.fr/PLP/863
related: http://opendata.inrae.fr/PLP/105
top concept of: PLP