RDF description of
primary topic: oligosaturé

oligosaturé
type: Concept
subject: Pedology @en
subject: Pédologie
definition: Qualifie un horizon ou un solum dont le taux de saturation du complexe adsorbant est compris entre 20 et 50 % (Référentiel Pédologique). (Source : INRA)
in scheme: PLP
preferred label: oligosaturated @en
related: http://opendata.inrae.fr/PLP/526
top concept of: PLP