RDF description of
primary topic: oligotrophe

oligotrophe
type: Concept
subject: Pedology @en
subject: Pédologie
definition: Qualifie un sol, autre qu'un histosol, ou un horizon dans lequel les conditions de croissance des plantes sont nettement défavorables : rareté des nutriments et du calcium et faible aération. (Source : INRA)
in scheme: PLP
note: Dans le Référentiel Pédologique, qualifie un histosol dont la production primaire de biomasse est faible. Un tel milieu est imparfaitement révélé par un pH très acide inférieur à 4,5. (Source : INRA)
preferred label: oligotrophic @en
related: http://opendata.inrae.fr/PLP/291
related: http://opendata.inrae.fr/PLP/599
related: http://opendata.inrae.fr/PLP/347
top concept of: PLP