organisation de l'azote
type: Concept
subject: Pedology @en
subject: Agronomie
subject: Pédologie
subject: Agronomy @en
modified: 2020-07-03T15:20:42.878+02:00
definition: Assimilation par les micro-organismes d'azote minéral du sol, conduisant à la formation d'azote organique. (Source : INRA)
in scheme: PLP
preferred label: immobilisation (azote) @en
top concept of: PLP

RDF description of
primary topic: organisation de l'azote