RDF description of
primary topic: organosols

organosols
type: Concept
subject: Pedology @en
subject: Pédologie
definition: Sols épais de plus de 10 cm, constitués uniquement d'horizons holorganiques O et/ou d'horizons Ah hémiorganiques, contenant plus de 8 % de carbone organique, formés en milieu aérobie bien ou assez bien drainant. (Source : INRA)
in scheme: PLP
note: On distingue des Organosols Holorganiques, des Organosols Calcaires, des Organosols Saturés et des Organosols Insaturés (Référentiel pédologique 2007). (Source : INRA)
top concept of: PLP