ortstein
type: Concept
subject: Pedology @en
subject: Pédologie
modified: 2020-08-27T14:57:15.606+02:00
alternative label: alios
definition: Horizon podzolique BP induré. (Source : INRA)
in scheme: PLP
note: Terme d'origine allemande. (Source : INRA)
top concept of: PLP

RDF description of
primary topic: ortstein