RDF description of
primary topic: oxydisols

oxydisols
type: Concept
subject: Pedology @en
subject: Pédologie
definition: Sols des climats tropicaux humides caractérisés par la dominance des sesquioxydes métalliques individualisés, principalement de fer et d'aluminium. (Source : INRA)
in scheme: PLP
note: Cette dominance s'exprime par la présence d'accumulations ferrugineuses fines (horizons oxydiques OX) ou grossières et discontinues : les nodules (horizon ND), ou continues plus ou moins indurées : les cuirasses (horizon OXm) ou les carapaces (horizon OXc). La présence de ces accumulations de sesquioxydes métalliques confère aux horizons oxydiques des comportements particuliers liés essentiellement à la présence de charges variables (Référentiel Pédologique 2007). (Source : INRA)
related: http://opendata.inrae.fr/PLP/153
related: http://opendata.inrae.fr/PLP/237
top concept of: PLP