RDF description of
primary topic: oxydoréduction

oxydoréduction
type: Concept
definition: Succession plus ou moins rapide de phases de réduction et d'oxydation dans des volumes pédologiques engorgés temporairement. (Source : INRA)
in scheme: PLP
note: Quand un volume est saturé en eau (périodes de réduction), il y a mobilisation du fer à l'état ferreux et quand l'aération revient (périodes d'oxydation), le fer redevient immobile à l'état ferrique et précipite sous la forme de taches, nodules, films, etc. (Source : INRA)
preferred label: oxidoreduction @en
related: http://opendata.inrae.fr/PLP/97
related: http://opendata.inrae.fr/PLP/782
related: http://opendata.inrae.fr/PLP/784
related: http://opendata.inrae.fr/PLP/499
related: http://opendata.inrae.fr/PLP/783
related: http://opendata.inrae.fr/PLP/786
related: http://opendata.inrae.fr/PLP/476
related: http://opendata.inrae.fr/PLP/842
related: http://opendata.inrae.fr/PLP/589
top concept of: PLP