aptitude culturale
type: Concept
subject: Pedology @en
subject: Agronomie
subject: Pédologie
subject: Agronomy @en
definition: Jugement porté sur une parcelle agricole ou un type de sol du double point de vue : - des potentialités caractérisées par les niveaux de production et leur fréquence d'obtention ; - de la souplesse et de la sécurité dans le choix et la mise en œuvre des systèmes de culture. (Source : INRA)
in scheme: PLP
note: L'aptitude culturale ne peut être jugée que par rapport à une production végétale précise (blé, vigne, asperges, maïs grain, tabac, chanvre, etc.) ou, au contraire, à l'étendue de la gamme des usages possibles sans porter atteinte à la qualité du sol (multifonctionnalité). (Source : INRA)
preferred label: crop suitability @en
related: http://opendata.inrae.fr/PLP/348
top concept of: PLP

RDF description of
primary topic: aptitude culturale