variegated
type: Concept
subject: Pedology
subject: Pédologie @fr
alternative label: mottled
definition: Qualifie un horizon qui montre des juxtapositions de taches ou de veines de colorations différentes et contrastées, le plus souvent dans le cas d'horizons hydromorphes. (Source : INRA) @fr
in scheme: PLP
preferred label: panaché @fr
related: http://opendata.inrae.fr/PLP/97
related: http://opendata.inrae.fr/PLP/782
related: http://opendata.inrae.fr/PLP/498
related: http://opendata.inrae.fr/PLP/476
related: http://opendata.inrae.fr/PLP/589
top concept of: PLP

RDF description of
primary topic: variegated