RDF description of
primary topic: paravertisols

paravertisols
type: Concept
definition: Catégorie de solums très évolués faisant transition entre les Lithovertisols et les Planosols Typiques (phase initiale de dé-vertisolisation) (Référentiel Pédologique). (Source : INRA)
in scheme: PLP
note: Ces solums présentent encore les principaux caractères des vertisols (horizons profonds vertiques SV et V) mais les horizons de surface ne présentent plus les propriétés vertiques. On distingue les Paravertisols Hapliques dont les horizons de surface sont nettement moins riches en argile (moins de 40 %) et les Paravertisols Planosoliques dont les horizons supérieurs (sur 20 à 30 cm d'épaisseur) sont nettement appauvris en argiles. En outre un horizon éluvial mince mais bien reconnaissable existe entre l'horizon de surface et l'horizon SV sous-jacent. Les horizons A et Eg sont souvent insaturés (rapport S/T inférieur à 80 %). (Source : INRA)
related: http://opendata.inrae.fr/PLP/1001
top concept of: PLP