RDF description of
primary topic: paysage pédologique

paysage pédologique
type: Concept
subject: Pedology @en
subject: Pédologie
alternative label: pedo-landscape @en
definition: Petites unités naturelles paraissant homogènes à un certain niveau de généralisation, découpées par le pédologue sur des critères comme la lithologie des roches sous-jacentes, les formes de modelé et d'autres éléments du paysage tels que l'hydrologie, l'occupation du sol, la végétation. (Source : INRA)
in scheme: PLP
note: En effet, à certaines échelles de publication de cartes de synthèse (e.g. 1/250 000), il n'est en général plus possible de distinguer graphiquement les différents types de sols tels qu'ils avaient pu être différenciés, par exemple sur des cartes publiées à 1/50 000. Ces unités de paysage ne résultent pas de l'agrégation raisonnée de plusieurs unités pédologiques, elles sont délimitées directement en tant qu'unités physiographiques (vallées alluviales, plateaux, grands versants). C'est seulement dans un second temps que leur contenu pédologique est fourni au lecteur. On décrit donc toujours les sols présents mais les clés principales du découpage des unités cartographiques ne sont pas forcément des clés pédologiques. (Source : INRA)
preferred label: soilscape @en
related: http://opendata.inrae.fr/PLP/934
related: http://opendata.inrae.fr/PLP/87
related: http://opendata.inrae.fr/PLP/992
related: http://opendata.inrae.fr/PLP/687
related: http://opendata.inrae.fr/PLP/259
top concept of: PLP