RDF description of
primary topic: pédicité

pédicité
type: Concept
subject: Pedology @en
subject: Agronomie
subject: Pédologie
subject: Agronomy @en
definition: Capacité d'un horizon de s'organiser dans sa totalité en agrégats (ou peds) stables. (Source : INRA)
in scheme: PLP
preferred label: pedality @en
related: http://opendata.inrae.fr/PLP/907
related: http://opendata.inrae.fr/PLP/23
top concept of: PLP